* installing *source* package ‘rladybugdb’ ...
** this is package ‘rladybugdb’ version ‘0.4.4’
** package ‘rladybugdb’ successfully unpacked and MD5 sums checked
** using staged installation
configure: extracting verified LadybugDB v0.20.4 source.
configure: 16-byte atomics are provided by the C++ toolchain.
configure: building LadybugDB v0.20.4 from source (maximum 2 jobs).
-- The CXX compiler identification is AppleClang 17.0.0.17000319
-- The C compiler identification is AppleClang 17.0.0.17000319
-- Detecting CXX compiler ABI info
-- Detecting CXX compiler ABI info - done
-- Check for working CXX compiler: /usr/bin/clang++ - skipped
-- Detecting CXX compile features
-- Detecting CXX compile features - done
-- Detecting C compiler ABI info
-- Detecting C compiler ABI info - done
-- Check for working C compiler: /usr/bin/clang - skipped
-- Detecting C compile features
-- Detecting C compile features - done
-- Multi-threaded mode is enabled: CMAKE_BUILD_PARALLEL_LEVEL=
-- Performing Test CMAKE_HAVE_LIBC_PTHREAD
-- Performing Test CMAKE_HAVE_LIBC_PTHREAD - Success
-- Found Threads: TRUE
-- 64-bit architecture detected
-- LBUG_PAGE_SIZE_LOG2: 12
-- LBUG_VECTOR_CAPACITY_LOG2: 11
-- LBUG_NODE_GROUP_SIZE_LOG2: 17
-- LBUG_MAX_SEGMENT_SIZE_LOG2: 18
-- Looking for F_FULLFSYNC
-- Looking for F_FULLFSYNC - found
-- Looking for fdatasync
-- Looking for fdatasync - not found
-- ✓ F_FULLFSYNC will be used on this platform
-- ✗ fdatasync not available, using fsync fallback
-- Build type is 'Release'
-- Performing Test BROTLI_EMSCRIPTEN
-- Performing Test BROTLI_EMSCRIPTEN - Failed
-- Compiler is not EMSCRIPTEN
-- Looking for log2 in m
-- Looking for log2 in m - found
-- Query processor SIMD: scalar filter path only
-- Configuring done (1.2s)
-- Generating done (0.7s)
-- Build files have been written to: /Volumes/Temp/tmp/rladybugdb-lbug.uYEi9z/build
[ 0%] Building CXX object src/extension/CMakeFiles/lbug_extension.dir/catalog_extension.cpp.o
[ 0%] Building CXX object third_party/antlr4_runtime/CMakeFiles/antlr4_runtime.dir/src/ANTLRErrorListener.cpp.o
[ 0%] Building CXX object third_party/antlr4_runtime/CMakeFiles/antlr4_runtime.dir/src/ANTLRErrorStrategy.cpp.o
[ 0%] Building CXX object third_party/antlr4_runtime/CMakeFiles/antlr4_runtime.dir/src/ANTLRFileStream.cpp.o
[ 0%] Building CXX object src/extension/CMakeFiles/lbug_extension.dir/extension.cpp.o
[ 0%] Building CXX object third_party/antlr4_runtime/CMakeFiles/antlr4_runtime.dir/src/ANTLRInputStream.cpp.o
[ 0%] Building CXX object third_party/antlr4_runtime/CMakeFiles/antlr4_runtime.dir/src/atn/ActionTransition.cpp.o
[ 0%] Building CXX object third_party/antlr4_runtime/CMakeFiles/antlr4_runtime.dir/src/atn/AmbiguityInfo.cpp.o
[ 0%] Building CXX object third_party/antlr4_runtime/CMakeFiles/antlr4_runtime.dir/src/atn/ArrayPredictionContext.cpp.o
[ 0%] Building CXX object src/extension/CMakeFiles/lbug_extension.dir/extension_entries.cpp.o
[ 1%] Building CXX object third_party/antlr4_runtime/CMakeFiles/antlr4_runtime.dir/src/atn/ATNConfig.cpp.o
[ 1%] Building CXX object third_party/antlr4_runtime/CMakeFiles/antlr4_runtime.dir/src/atn/ATNConfigSet.cpp.o
[ 1%] Building CXX object src/extension/CMakeFiles/lbug_extension.dir/extension_installer.cpp.o
[ 1%] Building CXX object third_party/antlr4_runtime/CMakeFiles/antlr4_runtime.dir/src/atn/ATN.cpp.o
[ 1%] Building CXX object third_party/antlr4_runtime/CMakeFiles/antlr4_runtime.dir/src/atn/ATNDeserializationOptions.cpp.o
[ 1%] Building CXX object src/extension/CMakeFiles/lbug_extension.dir/extension_manager.cpp.o
[ 1%] Building CXX object third_party/antlr4_runtime/CMakeFiles/antlr4_runtime.dir/src/atn/ATNDeserializer.cpp.o
[ 1%] Building CXX object third_party/antlr4_runtime/CMakeFiles/antlr4_runtime.dir/src/atn/ATNSimulator.cpp.o
[ 1%] Building CXX object src/extension/CMakeFiles/lbug_extension.dir/loaded_extension.cpp.o
[ 1%] Building CXX object third_party/antlr4_runtime/CMakeFiles/antlr4_runtime.dir/src/atn/ATNState.cpp.o
[ 1%] Building CXX object third_party/antlr4_runtime/CMakeFiles/antlr4_runtime.dir/src/atn/ATNStateType.cpp.o
[ 1%] Building CXX object third_party/antlr4_runtime/CMakeFiles/antlr4_runtime.dir/src/atn/AtomTransition.cpp.o
[ 1%] Built target lbug_extension
[ 1%] Building C object third_party/brotli/CMakeFiles/brotlicommon.dir/c/common/constants.c.o
[ 1%] Building C object third_party/brotli/CMakeFiles/brotlicommon.dir/c/common/context.c.o
[ 2%] Building C object third_party/brotli/CMakeFiles/brotlicommon.dir/c/common/dictionary.c.o
[ 2%] Building CXX object third_party/antlr4_runtime/CMakeFiles/antlr4_runtime.dir/src/atn/ContextSensitivityInfo.cpp.o
[ 2%] Building C object third_party/brotli/CMakeFiles/brotlicommon.dir/c/common/platform.c.o
[ 2%] Building C object third_party/brotli/CMakeFiles/brotlicommon.dir/c/common/shared_dictionary.c.o
[ 2%] Building C object third_party/brotli/CMakeFiles/brotlicommon.dir/c/common/transform.c.o
[ 2%] Linking C static library libbrotlicommon.a
[ 2%] Building CXX object third_party/antlr4_runtime/CMakeFiles/antlr4_runtime.dir/src/atn/DecisionEventInfo.cpp.o
[ 3%] Building CXX object third_party/antlr4_runtime/CMakeFiles/antlr4_runtime.dir/src/atn/DecisionInfo.cpp.o
[ 3%] Built target brotlicommon
[ 3%] Building CXX object third_party/fastpfor/CMakeFiles/fastpfor.dir/fastpfor/bitpacking.cpp.o
[ 3%] Building CXX object third_party/antlr4_runtime/CMakeFiles/antlr4_runtime.dir/src/atn/DecisionState.cpp.o
[ 3%] Building CXX object third_party/antlr4_runtime/CMakeFiles/antlr4_runtime.dir/src/atn/EpsilonTransition.cpp.o
[ 3%] Building CXX object third_party/antlr4_runtime/CMakeFiles/antlr4_runtime.dir/src/atn/ErrorInfo.cpp.o
[ 3%] Building CXX object third_party/antlr4_runtime/CMakeFiles/antlr4_runtime.dir/src/atn/LexerAction.cpp.o
[ 3%] Building CXX object third_party/antlr4_runtime/CMakeFiles/antlr4_runtime.dir/src/atn/LexerActionExecutor.cpp.o
[ 3%] Building CXX object third_party/antlr4_runtime/CMakeFiles/antlr4_runtime.dir/src/atn/LexerATNConfig.cpp.o
[ 3%] Building CXX object third_party/antlr4_runtime/CMakeFiles/antlr4_runtime.dir/src/atn/LexerATNSimulator.cpp.o
[ 3%] Building CXX object third_party/antlr4_runtime/CMakeFiles/antlr4_runtime.dir/src/atn/LexerChannelAction.cpp.o
[ 3%] Building CXX object third_party/antlr4_runtime/CMakeFiles/antlr4_runtime.dir/src/atn/LexerCustomAction.cpp.o
[ 3%] Building CXX object third_party/antlr4_runtime/CMakeFiles/antlr4_runtime.dir/src/atn/LexerIndexedCustomAction.cpp.o
[ 4%] Building CXX object third_party/antlr4_runtime/CMakeFiles/antlr4_runtime.dir/src/atn/LexerModeAction.cpp.o
[ 4%] Building CXX object third_party/antlr4_runtime/CMakeFiles/antlr4_runtime.dir/src/atn/LexerMoreAction.cpp.o
[ 4%] Building CXX object third_party/antlr4_runtime/CMakeFiles/antlr4_runtime.dir/src/atn/LexerPopModeAction.cpp.o
[ 4%] Building CXX object third_party/antlr4_runtime/CMakeFiles/antlr4_runtime.dir/src/atn/LexerPushModeAction.cpp.o
[ 4%] Building CXX object third_party/antlr4_runtime/CMakeFiles/antlr4_runtime.dir/src/atn/LexerSkipAction.cpp.o
[ 5%] Linking CXX static library libfastpfor.a
[ 5%] Built target fastpfor
[ 5%] Building CXX object third_party/antlr4_runtime/CMakeFiles/antlr4_runtime.dir/src/atn/LexerTypeAction.cpp.o
[ 5%] Building CXX object third_party/lz4/CMakeFiles/lz4.dir/lz4.cpp.o
[ 5%] Building CXX object third_party/antlr4_runtime/CMakeFiles/antlr4_runtime.dir/src/atn/LL1Analyzer.cpp.o
[ 5%] Building CXX object third_party/antlr4_runtime/CMakeFiles/antlr4_runtime.dir/src/atn/LookaheadEventInfo.cpp.o
[ 5%] Linking CXX static library liblz4.a
[ 5%] Built target lz4
[ 5%] Building CXX object third_party/antlr4_runtime/CMakeFiles/antlr4_runtime.dir/src/atn/NotSetTransition.cpp.o
[ 5%] Building CXX object third_party/mbedtls/CMakeFiles/mbedtls.dir/library/aes.cpp.o
[ 5%] Building CXX object third_party/mbedtls/CMakeFiles/mbedtls.dir/library/aria.cpp.o
[ 5%] Building CXX object third_party/mbedtls/CMakeFiles/mbedtls.dir/library/asn1parse.cpp.o
[ 5%] Building CXX object third_party/antlr4_runtime/CMakeFiles/antlr4_runtime.dir/src/atn/OrderedATNConfigSet.cpp.o
[ 5%] Building CXX object third_party/mbedtls/CMakeFiles/mbedtls.dir/library/base64.cpp.o
[ 6%] Building CXX object third_party/mbedtls/CMakeFiles/mbedtls.dir/library/bignum.cpp.o
[ 6%] Building CXX object third_party/mbedtls/CMakeFiles/mbedtls.dir/library/camellia.cpp.o
[ 6%] Building CXX object third_party/mbedtls/CMakeFiles/mbedtls.dir/library/cipher.cpp.o
[ 6%] Building CXX object third_party/mbedtls/CMakeFiles/mbedtls.dir/library/cipher_wrap.cpp.o
[ 6%] Building CXX object third_party/mbedtls/CMakeFiles/mbedtls.dir/library/constant_time.cpp.o
[ 6%] Building CXX object third_party/antlr4_runtime/CMakeFiles/antlr4_runtime.dir/src/atn/ParseInfo.cpp.o
[ 6%] Building CXX object third_party/mbedtls/CMakeFiles/mbedtls.dir/library/entropy.cpp.o
[ 6%] Building CXX object third_party/mbedtls/CMakeFiles/mbedtls.dir/library/entropy_poll.cpp.o
[ 6%] Building CXX object third_party/mbedtls/CMakeFiles/mbedtls.dir/library/gcm.cpp.o
[ 6%] Building CXX object third_party/mbedtls/CMakeFiles/mbedtls.dir/library/md.cpp.o
[ 6%] Building CXX object third_party/mbedtls/CMakeFiles/mbedtls.dir/library/oid.cpp.o
[ 6%] Building CXX object third_party/mbedtls/CMakeFiles/mbedtls.dir/library/pem.cpp.o
[ 7%] Building CXX object third_party/mbedtls/CMakeFiles/mbedtls.dir/library/pk.cpp.o
[ 7%] Building CXX object third_party/mbedtls/CMakeFiles/mbedtls.dir/library/pk_wrap.cpp.o
[ 7%] Building CXX object third_party/mbedtls/CMakeFiles/mbedtls.dir/library/pkparse.cpp.o
[ 7%] Building CXX object third_party/mbedtls/CMakeFiles/mbedtls.dir/library/platform_util.cpp.o
[ 7%] Building CXX object third_party/mbedtls/CMakeFiles/mbedtls.dir/library/rsa.cpp.o
[ 7%] Building CXX object third_party/mbedtls/CMakeFiles/mbedtls.dir/library/rsa_alt_helpers.cpp.o
[ 8%] Building CXX object third_party/antlr4_runtime/CMakeFiles/antlr4_runtime.dir/src/atn/ParserATNSimulator.cpp.o
[ 8%] Building CXX object third_party/mbedtls/CMakeFiles/mbedtls.dir/library/sha1.cpp.o
[ 8%] Building CXX object third_party/mbedtls/CMakeFiles/mbedtls.dir/library/sha256.cpp.o
[ 8%] Building CXX object third_party/mbedtls/CMakeFiles/mbedtls.dir/library/sha512.cpp.o
[ 8%] Linking CXX static library libmbedtls.a
[ 8%] Built target mbedtls
[ 8%] Building CXX object third_party/miniz/CMakeFiles/miniz.dir/miniz.cpp.o
[ 9%] Linking CXX static library libminiz.a
[ 9%] Built target miniz
[ 9%] Building CXX object third_party/antlr4_runtime/CMakeFiles/antlr4_runtime.dir/src/atn/PrecedencePredicateTransition.cpp.o
[ 9%] Building CXX object third_party/parquet/CMakeFiles/parquet.dir/parquet_constants.cpp.o
[ 9%] Building CXX object third_party/antlr4_runtime/CMakeFiles/antlr4_runtime.dir/src/atn/PredicateEvalInfo.cpp.o
[ 9%] Building CXX object third_party/parquet/CMakeFiles/parquet.dir/parquet_types.cpp.o
[ 9%] Building CXX object third_party/antlr4_runtime/CMakeFiles/antlr4_runtime.dir/src/atn/PredicateTransition.cpp.o
[ 9%] Building CXX object third_party/antlr4_runtime/CMakeFiles/antlr4_runtime.dir/src/atn/PredictionContextCache.cpp.o
[ 9%] Building CXX object third_party/antlr4_runtime/CMakeFiles/antlr4_runtime.dir/src/atn/PredictionContext.cpp.o
[ 9%] Linking CXX static library libparquet.a
[ 9%] Built target parquet
[ 9%] Building CXX object third_party/antlr4_runtime/CMakeFiles/antlr4_runtime.dir/src/atn/PredictionContextMergeCache.cpp.o
[ 9%] Building CXX object third_party/re2/CMakeFiles/re2.dir/bitstate.cpp.o
[ 9%] Building CXX object third_party/re2/CMakeFiles/re2.dir/compile.cpp.o
[ 9%] Building CXX object third_party/antlr4_runtime/CMakeFiles/antlr4_runtime.dir/src/atn/PredictionMode.cpp.o
[ 9%] Building CXX object third_party/re2/CMakeFiles/re2.dir/dfa.cpp.o
[ 9%] Building CXX object third_party/antlr4_runtime/CMakeFiles/antlr4_runtime.dir/src/atn/ProfilingATNSimulator.cpp.o
[ 9%] Building CXX object third_party/re2/CMakeFiles/re2.dir/filtered_re2.cpp.o
[ 9%] Building CXX object third_party/antlr4_runtime/CMakeFiles/antlr4_runtime.dir/src/atn/RangeTransition.cpp.o
[ 9%] Building CXX object third_party/re2/CMakeFiles/re2.dir/mimics_pcre.cpp.o
[ 9%] Building CXX object third_party/antlr4_runtime/CMakeFiles/antlr4_runtime.dir/src/atn/RuleTransition.cpp.o
[ 9%] Building CXX object third_party/re2/CMakeFiles/re2.dir/nfa.cpp.o
[ 10%] Building CXX object third_party/antlr4_runtime/CMakeFiles/antlr4_runtime.dir/src/atn/SemanticContext.cpp.o
[ 10%] Building CXX object third_party/re2/CMakeFiles/re2.dir/onepass.cpp.o
[ 11%] Building CXX object third_party/re2/CMakeFiles/re2.dir/parse.cpp.o
[ 11%] Building CXX object third_party/antlr4_runtime/CMakeFiles/antlr4_runtime.dir/src/atn/SetTransition.cpp.o
[ 11%] Building CXX object third_party/antlr4_runtime/CMakeFiles/antlr4_runtime.dir/src/atn/SingletonPredictionContext.cpp.o
[ 11%] Building CXX object third_party/re2/CMakeFiles/re2.dir/perl_groups.cpp.o
[ 11%] Building CXX object third_party/re2/CMakeFiles/re2.dir/prefilter.cpp.o
[ 11%] Building CXX object third_party/antlr4_runtime/CMakeFiles/antlr4_runtime.dir/src/atn/StarLoopbackState.cpp.o
[ 11%] Building CXX object third_party/re2/CMakeFiles/re2.dir/prefilter_tree.cpp.o
[ 11%] Building CXX object third_party/antlr4_runtime/CMakeFiles/antlr4_runtime.dir/src/atn/Transition.cpp.o
[ 11%] Building CXX object third_party/re2/CMakeFiles/re2.dir/prog.cpp.o
[ 11%] Building CXX object third_party/antlr4_runtime/CMakeFiles/antlr4_runtime.dir/src/atn/TransitionType.cpp.o
[ 11%] Building CXX object third_party/antlr4_runtime/CMakeFiles/antlr4_runtime.dir/src/atn/WildcardTransition.cpp.o
[ 11%] Building CXX object third_party/re2/CMakeFiles/re2.dir/re2.cpp.o
[ 11%] Building CXX object third_party/antlr4_runtime/CMakeFiles/antlr4_runtime.dir/src/BailErrorStrategy.cpp.o
[ 11%] Building CXX object third_party/re2/CMakeFiles/re2.dir/regexp.cpp.o
[ 11%] Building CXX object third_party/antlr4_runtime/CMakeFiles/antlr4_runtime.dir/src/BaseErrorListener.cpp.o
[ 11%] Building CXX object third_party/re2/CMakeFiles/re2.dir/set.cpp.o
[ 11%] Building CXX object third_party/antlr4_runtime/CMakeFiles/antlr4_runtime.dir/src/BufferedTokenStream.cpp.o
[ 11%] Building CXX object third_party/re2/CMakeFiles/re2.dir/simplify.cpp.o
[ 11%] Building CXX object third_party/antlr4_runtime/CMakeFiles/antlr4_runtime.dir/src/CharStream.cpp.o
[ 11%] Building CXX object third_party/re2/CMakeFiles/re2.dir/stringpiece.cpp.o
[ 11%] Building CXX object third_party/re2/CMakeFiles/re2.dir/tostring.cpp.o
[ 12%] Building CXX object third_party/antlr4_runtime/CMakeFiles/antlr4_runtime.dir/src/CommonToken.cpp.o
[ 13%] Building CXX object third_party/re2/CMakeFiles/re2.dir/unicode_casefold.cpp.o
[ 13%] Building CXX object third_party/re2/CMakeFiles/re2.dir/unicode_groups.cpp.o
[ 13%] Building CXX object third_party/re2/CMakeFiles/re2.dir/rune.cpp.o
[ 13%] Building CXX object third_party/antlr4_runtime/CMakeFiles/antlr4_runtime.dir/src/CommonTokenFactory.cpp.o
[ 13%] Building CXX object third_party/re2/CMakeFiles/re2.dir/strutil.cpp.o
[ 13%] Linking CXX static library libre2.a
[ 13%] Built target re2
[ 13%] Building C object third_party/roaring_bitmap/CMakeFiles/roaring_bitmap.dir/roaring.c.o
In file included from /Volumes/Temp/tmp/rladybugdb-lbug.uYEi9z/lbug-src/third_party/roaring_bitmap/roaring.c:68:
/Volumes/Temp/tmp/rladybugdb-lbug.uYEi9z/lbug-src/third_party/roaring_bitmap/roaring.h:1163:5: warning: static function 'lbug_r_no_printf' is used in an inline function with external linkage [-Wstatic-in-inline]
1163 | printf("{");
| ^
/Volumes/Temp/tmp/rladybugdb-lbug.uYEi9z/lbug-src/third_party/roaring_bitmap/roaring.c:65:21: note: expanded from macro 'printf'
65 | #define printf(...) lbug_r_no_printf(__VA_ARGS__)
| ^
/Volumes/Temp/tmp/rladybugdb-lbug.uYEi9z/lbug-src/third_party/roaring_bitmap/roaring.h:1162:1: note: use 'static' to give inline function 'bitset_print' internal linkage
1162 | inline void bitset_print(const bitset_t *b) {
| ^
| static
/Volumes/Temp/tmp/rladybugdb-lbug.uYEi9z/lbug-src/third_party/roaring_bitmap/roaring.c:61:12: note: 'lbug_r_no_printf' declared here
61 | static int lbug_r_no_printf(const char *format, ...) {
| ^
In file included from /Volumes/Temp/tmp/rladybugdb-lbug.uYEi9z/lbug-src/third_party/roaring_bitmap/roaring.c:68:
/Volumes/Temp/tmp/rladybugdb-lbug.uYEi9z/lbug-src/third_party/roaring_bitmap/roaring.h:1165:9: warning: static function 'lbug_r_no_printf' is used in an inline function with external linkage [-Wstatic-in-inline]
1165 | printf("%zu, ", i);
| ^
/Volumes/Temp/tmp/rladybugdb-lbug.uYEi9z/lbug-src/third_party/roaring_bitmap/roaring.c:65:21: note: expanded from macro 'printf'
65 | #define printf(...) lbug_r_no_printf(__VA_ARGS__)
| ^
/Volumes/Temp/tmp/rladybugdb-lbug.uYEi9z/lbug-src/third_party/roaring_bitmap/roaring.h:1162:1: note: use 'static' to give inline function 'bitset_print' internal linkage
1162 | inline void bitset_print(const bitset_t *b) {
| ^
| static
/Volumes/Temp/tmp/rladybugdb-lbug.uYEi9z/lbug-src/third_party/roaring_bitmap/roaring.c:61:12: note: 'lbug_r_no_printf' declared here
61 | static int lbug_r_no_printf(const char *format, ...) {
| ^
In file included from /Volumes/Temp/tmp/rladybugdb-lbug.uYEi9z/lbug-src/third_party/roaring_bitmap/roaring.c:68:
/Volumes/Temp/tmp/rladybugdb-lbug.uYEi9z/lbug-src/third_party/roaring_bitmap/roaring.h:1167:5: warning: static function 'lbug_r_no_printf' is used in an inline function with external linkage [-Wstatic-in-inline]
1167 | printf("}");
| ^
/Volumes/Temp/tmp/rladybugdb-lbug.uYEi9z/lbug-src/third_party/roaring_bitmap/roaring.c:65:21: note: expanded from macro 'printf'
65 | #define printf(...) lbug_r_no_printf(__VA_ARGS__)
| ^
/Volumes/Temp/tmp/rladybugdb-lbug.uYEi9z/lbug-src/third_party/roaring_bitmap/roaring.h:1162:1: note: use 'static' to give inline function 'bitset_print' internal linkage
1162 | inline void bitset_print(const bitset_t *b) {
| ^
| static
/Volumes/Temp/tmp/rladybugdb-lbug.uYEi9z/lbug-src/third_party/roaring_bitmap/roaring.c:61:12: note: 'lbug_r_no_printf' declared here
61 | static int lbug_r_no_printf(const char *format, ...) {
| ^
[ 13%] Building CXX object third_party/antlr4_runtime/CMakeFiles/antlr4_runtime.dir/src/CommonTokenStream.cpp.o
[ 13%] Building CXX object third_party/antlr4_runtime/CMakeFiles/antlr4_runtime.dir/src/ConsoleErrorListener.cpp.o
[ 13%] Building CXX object third_party/antlr4_runtime/CMakeFiles/antlr4_runtime.dir/src/DefaultErrorStrategy.cpp.o
[ 13%] Building CXX object third_party/antlr4_runtime/CMakeFiles/antlr4_runtime.dir/src/dfa/DFA.cpp.o
3 warnings generated.
[ 13%] Linking C static library libroaring_bitmap.a
[ 13%] Built target roaring_bitmap
[ 13%] Building CXX object third_party/antlr4_runtime/CMakeFiles/antlr4_runtime.dir/src/dfa/DFASerializer.cpp.o
[ 13%] Building C object third_party/simsimd/CMakeFiles/simsimd.dir/lib.c.o
[ 13%] Building CXX object third_party/antlr4_runtime/CMakeFiles/antlr4_runtime.dir/src/dfa/DFAState.cpp.o
[ 13%] Linking C static library libsimsimd.a
[ 13%] Built target simsimd
[ 13%] Building CXX object third_party/antlr4_runtime/CMakeFiles/antlr4_runtime.dir/src/dfa/LexerDFASerializer.cpp.o
[ 13%] Building CXX object third_party/snappy/CMakeFiles/snappy.dir/snappy.cc.o
[ 13%] Building CXX object third_party/antlr4_runtime/CMakeFiles/antlr4_runtime.dir/src/DiagnosticErrorListener.cpp.o
[ 13%] Building CXX object third_party/snappy/CMakeFiles/snappy.dir/snappy-sinksource.cc.o
[ 14%] Linking CXX static library libsnappy.a
[ 14%] Building CXX object third_party/antlr4_runtime/CMakeFiles/antlr4_runtime.dir/src/Exceptions.cpp.o
[ 14%] Built target snappy
[ 15%] Building CXX object third_party/antlr4_runtime/CMakeFiles/antlr4_runtime.dir/src/FailedPredicateException.cpp.o
[ 15%] Building CXX object third_party/thrift/CMakeFiles/thrift.dir/protocol/TProtocol.cpp.o
[ 15%] Building CXX object third_party/antlr4_runtime/CMakeFiles/antlr4_runtime.dir/src/InputMismatchException.cpp.o
[ 15%] Building CXX object third_party/thrift/CMakeFiles/thrift.dir/transport/TTransportException.cpp.o
[ 15%] Building CXX object third_party/antlr4_runtime/CMakeFiles/antlr4_runtime.dir/src/internal/Synchronization.cpp.o
[ 15%] Building CXX object third_party/thrift/CMakeFiles/thrift.dir/transport/TBufferTransports.cpp.o
[ 15%] Building CXX object third_party/antlr4_runtime/CMakeFiles/antlr4_runtime.dir/src/InterpreterRuleContext.cpp.o
[ 15%] Linking CXX static library libthrift.a
[ 15%] Built target thrift
[ 15%] Building CXX object third_party/antlr4_runtime/CMakeFiles/antlr4_runtime.dir/src/IntStream.cpp.o
[ 15%] Building CXX object third_party/utf8proc/CMakeFiles/utf8proc.dir/utf8proc.cpp.o
[ 15%] Building CXX object third_party/antlr4_runtime/CMakeFiles/antlr4_runtime.dir/src/Lexer.cpp.o
[ 15%] Building CXX object third_party/utf8proc/CMakeFiles/utf8proc.dir/utf8proc_wrapper.cpp.o
[ 15%] Linking CXX static library libutf8proc.a
[ 15%] Built target utf8proc
[ 15%] Building C object third_party/yyjson/CMakeFiles/yyjson.dir/src/yyjson.c.o
[ 15%] Building CXX object third_party/antlr4_runtime/CMakeFiles/antlr4_runtime.dir/src/LexerInterpreter.cpp.o
[ 15%] Building CXX object third_party/antlr4_runtime/CMakeFiles/antlr4_runtime.dir/src/LexerNoViableAltException.cpp.o
[ 15%] Building CXX object third_party/antlr4_runtime/CMakeFiles/antlr4_runtime.dir/src/ListTokenSource.cpp.o
[ 15%] Building CXX object third_party/antlr4_runtime/CMakeFiles/antlr4_runtime.dir/src/misc/InterpreterDataReader.cpp.o
[ 15%] Linking C static library libyyjson.a
[ 15%] Built target yyjson
[ 15%] Building CXX object third_party/antlr4_runtime/CMakeFiles/antlr4_runtime.dir/src/misc/Interval.cpp.o
[ 16%] Building CXX object third_party/antlr4_runtime/CMakeFiles/antlr4_runtime.dir/src/misc/IntervalSet.cpp.o
[ 16%] Building CXX object third_party/zstd/CMakeFiles/zstd.dir/common/entropy_common.cpp.o
[ 17%] Building CXX object third_party/zstd/CMakeFiles/zstd.dir/common/error_private.cpp.o
[ 17%] Building CXX object third_party/zstd/CMakeFiles/zstd.dir/common/fse_decompress.cpp.o
[ 17%] Building CXX object third_party/zstd/CMakeFiles/zstd.dir/common/xxhash.cpp.o
[ 17%] Building CXX object third_party/zstd/CMakeFiles/zstd.dir/common/zstd_common.cpp.o
[ 17%] Building CXX object third_party/zstd/CMakeFiles/zstd.dir/compress/fse_compress.cpp.o
[ 17%] Building CXX object third_party/antlr4_runtime/CMakeFiles/antlr4_runtime.dir/src/misc/MurmurHash.cpp.o
[ 17%] Building CXX object third_party/zstd/CMakeFiles/zstd.dir/compress/hist.cpp.o
[ 17%] Building CXX object third_party/zstd/CMakeFiles/zstd.dir/compress/huf_compress.cpp.o
[ 17%] Building CXX object third_party/zstd/CMakeFiles/zstd.dir/compress/zstd_compress.cpp.o
[ 17%] Building CXX object third_party/antlr4_runtime/CMakeFiles/antlr4_runtime.dir/src/misc/Predicate.cpp.o
[ 17%] Building CXX object third_party/antlr4_runtime/CMakeFiles/antlr4_runtime.dir/src/NoViableAltException.cpp.o
[ 17%] Building CXX object third_party/zstd/CMakeFiles/zstd.dir/compress/zstd_compress_literals.cpp.o
[ 17%] Building CXX object third_party/zstd/CMakeFiles/zstd.dir/compress/zstd_compress_sequences.cpp.o
[ 17%] Building CXX object third_party/zstd/CMakeFiles/zstd.dir/compress/zstd_compress_superblock.cpp.o
[ 18%] Building CXX object third_party/zstd/CMakeFiles/zstd.dir/compress/zstd_double_fast.cpp.o
[ 18%] Building CXX object third_party/antlr4_runtime/CMakeFiles/antlr4_runtime.dir/src/Parser.cpp.o
[ 18%] Building CXX object third_party/zstd/CMakeFiles/zstd.dir/compress/zstd_fast.cpp.o
[ 18%] Building CXX object third_party/antlr4_runtime/CMakeFiles/antlr4_runtime.dir/src/ParserInterpreter.cpp.o
[ 18%] Building CXX object third_party/zstd/CMakeFiles/zstd.dir/compress/zstd_lazy.cpp.o
[ 18%] Building CXX object third_party/antlr4_runtime/CMakeFiles/antlr4_runtime.dir/src/ParserRuleContext.cpp.o
[ 18%] Building CXX object third_party/antlr4_runtime/CMakeFiles/antlr4_runtime.dir/src/ProxyErrorListener.cpp.o
[ 18%] Building CXX object third_party/antlr4_runtime/CMakeFiles/antlr4_runtime.dir/src/RecognitionException.cpp.o
[ 18%] Building CXX object third_party/zstd/CMakeFiles/zstd.dir/compress/zstd_ldm.cpp.o
[ 18%] Building CXX object third_party/zstd/CMakeFiles/zstd.dir/compress/zstd_opt.cpp.o
[ 18%] Building CXX object third_party/antlr4_runtime/CMakeFiles/antlr4_runtime.dir/src/Recognizer.cpp.o
[ 18%] Building CXX object third_party/zstd/CMakeFiles/zstd.dir/compress/zstd_preSplit.cpp.o
[ 18%] Building CXX object third_party/zstd/CMakeFiles/zstd.dir/decompress/huf_decompress.cpp.o
[ 18%] Building CXX object third_party/zstd/CMakeFiles/zstd.dir/decompress/zstd_ddict.cpp.o
[ 18%] Building CXX object third_party/antlr4_runtime/CMakeFiles/antlr4_runtime.dir/src/RuleContext.cpp.o
[ 18%] Building CXX object third_party/zstd/CMakeFiles/zstd.dir/decompress/zstd_decompress.cpp.o
[ 18%] Building CXX object third_party/zstd/CMakeFiles/zstd.dir/decompress/zstd_decompress_block.cpp.o
[ 19%] Building CXX object third_party/antlr4_runtime/CMakeFiles/antlr4_runtime.dir/src/RuleContextWithAltNum.cpp.o
[ 20%] Linking CXX static library libzstd.a
[ 20%] Built target zstd
[ 20%] Building CXX object third_party/antlr4_runtime/CMakeFiles/antlr4_runtime.dir/src/RuntimeMetaData.cpp.o
[ 20%] Building CXX object third_party/antlr4_runtime/CMakeFiles/antlr4_runtime.dir/src/support/Any.cpp.o
[ 20%] Building CXX object src/binder/CMakeFiles/lbug_binder.dir/binder.cpp.o
[ 20%] Building CXX object third_party/antlr4_runtime/CMakeFiles/antlr4_runtime.dir/src/support/Arrays.cpp.o
[ 20%] Building CXX object third_party/antlr4_runtime/CMakeFiles/antlr4_runtime.dir/src/support/CPPUtils.cpp.o
[ 20%] Building CXX object third_party/antlr4_runtime/CMakeFiles/antlr4_runtime.dir/src/support/StringUtils.cpp.o
[ 20%] Building CXX object third_party/antlr4_runtime/CMakeFiles/antlr4_runtime.dir/src/support/Utf8.cpp.o
[ 20%] Building CXX object third_party/antlr4_runtime/CMakeFiles/antlr4_runtime.dir/src/Token.cpp.o
[ 20%] Building CXX object third_party/antlr4_runtime/CMakeFiles/antlr4_runtime.dir/src/TokenSource.cpp.o
[ 20%] Building CXX object src/binder/CMakeFiles/lbug_binder.dir/binder_scope.cpp.o
[ 20%] Building CXX object third_party/antlr4_runtime/CMakeFiles/antlr4_runtime.dir/src/TokenStream.cpp.o
[ 20%] Building CXX object src/binder/CMakeFiles/lbug_binder.dir/bound_statement_result.cpp.o
[ 20%] Building CXX object third_party/antlr4_runtime/CMakeFiles/antlr4_runtime.dir/src/TokenStreamRewriter.cpp.o
[ 20%] Building CXX object src/binder/CMakeFiles/lbug_binder.dir/bound_scan_source.cpp.o
[ 21%] Building CXX object third_party/antlr4_runtime/CMakeFiles/antlr4_runtime.dir/src/tree/ErrorNodeImpl.cpp.o
[ 21%] Building CXX object third_party/antlr4_runtime/CMakeFiles/antlr4_runtime.dir/src/tree/IterativeParseTreeWalker.cpp.o
[ 21%] Building CXX object src/binder/CMakeFiles/lbug_binder.dir/bound_statement_rewriter.cpp.o
[ 21%] Building CXX object third_party/antlr4_runtime/CMakeFiles/antlr4_runtime.dir/src/tree/ParseTree.cpp.o
[ 21%] Building CXX object third_party/antlr4_runtime/CMakeFiles/antlr4_runtime.dir/src/tree/ParseTreeListener.cpp.o
[ 21%] Building CXX object third_party/antlr4_runtime/CMakeFiles/antlr4_runtime.dir/src/tree/ParseTreeVisitor.cpp.o
[ 21%] Building CXX object src/binder/CMakeFiles/lbug_binder.dir/bound_statement_visitor.cpp.o
[ 21%] Building CXX object third_party/antlr4_runtime/CMakeFiles/antlr4_runtime.dir/src/tree/ParseTreeWalker.cpp.o
[ 21%] Building CXX object third_party/antlr4_runtime/CMakeFiles/antlr4_runtime.dir/src/tree/pattern/Chunk.cpp.o
[ 21%] Building CXX object third_party/antlr4_runtime/CMakeFiles/antlr4_runtime.dir/src/tree/pattern/ParseTreeMatch.cpp.o
[ 21%] Building CXX object src/binder/CMakeFiles/lbug_binder.dir/expression_binder.cpp.o
[ 21%] Building CXX object third_party/antlr4_runtime/CMakeFiles/antlr4_runtime.dir/src/tree/pattern/ParseTreePattern.cpp.o
[ 21%] Building CXX object third_party/antlr4_runtime/CMakeFiles/antlr4_runtime.dir/src/tree/pattern/ParseTreePatternMatcher.cpp.o
[ 21%] Building CXX object third_party/antlr4_runtime/CMakeFiles/antlr4_runtime.dir/src/tree/pattern/RuleTagToken.cpp.o
[ 21%] Building CXX object src/binder/CMakeFiles/lbug_binder.dir/expression_visitor.cpp.o
[ 22%] Building CXX object third_party/antlr4_runtime/CMakeFiles/antlr4_runtime.dir/src/tree/pattern/TagChunk.cpp.o
[ 22%] Building CXX object third_party/antlr4_runtime/CMakeFiles/antlr4_runtime.dir/src/tree/pattern/TextChunk.cpp.o
[ 22%] Building CXX object third_party/antlr4_runtime/CMakeFiles/antlr4_runtime.dir/src/tree/pattern/TokenTagToken.cpp.o
[ 22%] Built target lbug_binder
[ 22%] Building CXX object third_party/antlr4_runtime/CMakeFiles/antlr4_runtime.dir/src/tree/TerminalNodeImpl.cpp.o
[ 22%] Building CXX object third_party/antlr4_runtime/CMakeFiles/antlr4_runtime.dir/src/tree/Trees.cpp.o
[ 22%] Building CXX object src/binder/bind/CMakeFiles/lbug_binder_bind.dir/bind_attach_database.cpp.o
[ 22%] Building CXX object third_party/antlr4_runtime/CMakeFiles/antlr4_runtime.dir/src/tree/xpath/XPath.cpp.o
[ 22%] Building CXX object third_party/antlr4_runtime/CMakeFiles/antlr4_runtime.dir/src/tree/xpath/XPathElement.cpp.o
[ 22%] Building CXX object third_party/antlr4_runtime/CMakeFiles/antlr4_runtime.dir/src/tree/xpath/XPathLexer.cpp.o
[ 23%] Building CXX object src/binder/bind/CMakeFiles/lbug_binder_bind.dir/bind_analyze.cpp.o
[ 23%] Building CXX object third_party/antlr4_runtime/CMakeFiles/antlr4_runtime.dir/src/tree/xpath/XPathLexerErrorListener.cpp.o
[ 23%] Building CXX object third_party/antlr4_runtime/CMakeFiles/antlr4_runtime.dir/src/tree/xpath/XPathRuleAnywhereElement.cpp.o
[ 23%] Building CXX object src/binder/bind/CMakeFiles/lbug_binder_bind.dir/bind_create_macro.cpp.o
[ 23%] Building CXX object third_party/antlr4_runtime/CMakeFiles/antlr4_runtime.dir/src/tree/xpath/XPathRuleElement.cpp.o
[ 24%] Building CXX object third_party/antlr4_runtime/CMakeFiles/antlr4_runtime.dir/src/tree/xpath/XPathTokenAnywhereElement.cpp.o
[ 24%] Building CXX object third_party/antlr4_runtime/CMakeFiles/antlr4_runtime.dir/src/tree/xpath/XPathTokenElement.cpp.o
[ 24%] Building CXX object third_party/antlr4_runtime/CMakeFiles/antlr4_runtime.dir/src/tree/xpath/XPathWildcardAnywhereElement.cpp.o
[ 24%] Building CXX object third_party/antlr4_runtime/CMakeFiles/antlr4_runtime.dir/src/tree/xpath/XPathWildcardElement.cpp.o
[ 24%] Building CXX object src/binder/bind/CMakeFiles/lbug_binder_bind.dir/bind_ddl.cpp.o
[ 24%] Building CXX object third_party/antlr4_runtime/CMakeFiles/antlr4_runtime.dir/src/UnbufferedCharStream.cpp.o
[ 24%] Building CXX object third_party/antlr4_runtime/CMakeFiles/antlr4_runtime.dir/src/UnbufferedTokenStream.cpp.o
[ 24%] Building CXX object third_party/antlr4_runtime/CMakeFiles/antlr4_runtime.dir/src/Vocabulary.cpp.o
[ 24%] Building CXX object third_party/antlr4_runtime/CMakeFiles/antlr4_runtime.dir/src/WritableToken.cpp.o
[ 24%] Linking CXX static library libantlr4_runtime.a
[ 24%] Built target antlr4_runtime
[ 24%] Building CXX object src/binder/bind/CMakeFiles/lbug_binder_bind.dir/bind_detach_database.cpp.o
[ 24%] Building CXX object src/binder/bind/copy/CMakeFiles/lbug_binder_bind_copy.dir/bind_copy_to.cpp.o
[ 24%] Building CXX object src/binder/bind/CMakeFiles/lbug_binder_bind.dir/bind_explain.cpp.o
[ 24%] Building CXX object src/binder/bind/CMakeFiles/lbug_binder_bind.dir/bind_extension_clause.cpp.o
[ 25%] Building CXX object src/binder/bind/copy/CMakeFiles/lbug_binder_bind_copy.dir/bind_copy_from.cpp.o
[ 25%] Building CXX object src/binder/bind/CMakeFiles/lbug_binder_bind.dir/bind_file_scan.cpp.o
[ 25%] Built target lbug_binder_bind_copy
[ 25%] Building CXX object src/binder/bind/ddl/CMakeFiles/lbug_binder_bind_ddl.dir/bound_create_table_info.cpp.o
[ 25%] Built target lbug_binder_bind_ddl
[ 25%] Building CXX object src/binder/bind/read/CMakeFiles/lbug_binder_bind_read.dir/bind_in_query_call.cpp.o
[ 25%] Building CXX object src/binder/bind/CMakeFiles/lbug_binder_bind.dir/bind_graph.cpp.o
[ 25%] Building CXX object src/binder/bind/CMakeFiles/lbug_binder_bind.dir/bind_graph_pattern.cpp.o
[ 25%] Building CXX object src/binder/bind/read/CMakeFiles/lbug_binder_bind_read.dir/bind_load_from.cpp.o
[ 25%] Building CXX object src/binder/bind/read/CMakeFiles/lbug_binder_bind_read.dir/bind_match.cpp.o
[ 25%] Building CXX object src/binder/bind/CMakeFiles/lbug_binder_bind.dir/bind_projection_clause.cpp.o
[ 25%] Building CXX object src/binder/bind/read/CMakeFiles/lbug_binder_bind_read.dir/bind_unwind.cpp.o
[ 25%] Building CXX object src/binder/bind/CMakeFiles/lbug_binder_bind.dir/bind_query.cpp.o
[ 25%] Built target lbug_binder_bind_read
[ 26%] Building CXX object src/binder/bind/CMakeFiles/lbug_binder_bind.dir/bind_reading_clause.cpp.o
[ 26%] Building CXX object src/binder/bind_expression/CMakeFiles/lbug_binder_bind_expression.dir/bind_boolean_expression.cpp.o
[ 26%] Building CXX object src/binder/bind/CMakeFiles/lbug_binder_bind.dir/bind_standalone_call.cpp.o
[ 26%] Building CXX object src/binder/bind_expression/CMakeFiles/lbug_binder_bind_expression.dir/bind_case_expression.cpp.o
[ 26%] Building CXX object src/binder/bind/CMakeFiles/lbug_binder_bind.dir/bind_table_function.cpp.o
[ 26%] Building CXX object src/binder/bind_expression/CMakeFiles/lbug_binder_bind_expression.dir/bind_comparison_expression.cpp.o
[ 26%] Building CXX object src/binder/bind/CMakeFiles/lbug_binder_bind.dir/bind_transaction.cpp.o
[ 26%] Building CXX object src/binder/bind_expression/CMakeFiles/lbug_binder_bind_expression.dir/bind_function_expression.cpp.o
[ 26%] Building CXX object src/binder/bind/CMakeFiles/lbug_binder_bind.dir/bind_updating_clause.cpp.o
[ 26%] Building CXX object src/binder/bind_expression/CMakeFiles/lbug_binder_bind_expression.dir/bind_literal_expression.cpp.o
[ 26%] Building CXX object src/binder/bind_expression/CMakeFiles/lbug_binder_bind_expression.dir/bind_null_operator_expression.cpp.o
[ 26%] Building CXX object src/binder/bind/CMakeFiles/lbug_binder_bind.dir/bind_extension.cpp.o
[ 26%] Building CXX object src/binder/bind_expression/CMakeFiles/lbug_binder_bind_expression.dir/bind_parameter_expression.cpp.o
[ 26%] Building CXX object src/binder/bind_expression/CMakeFiles/lbug_binder_bind_expression.dir/bind_property_expression.cpp.o
[ 26%] Building CXX object src/binder/bind/CMakeFiles/lbug_binder_bind.dir/bind_export_database.cpp.o
[ 26%] Building CXX object src/binder/bind_expression/CMakeFiles/lbug_binder_bind_expression.dir/bind_subquery_expression.cpp.o
[ 26%] Building CXX object src/binder/bind/CMakeFiles/lbug_binder_bind.dir/bind_import_database.cpp.o
[ 27%] Building CXX object src/binder/bind_expression/CMakeFiles/lbug_binder_bind_expression.dir/bind_variable_expression.cpp.o
[ 27%] Building CXX object src/binder/bind_expression/CMakeFiles/lbug_binder_bind_expression.dir/bind_lambda_expression.cpp.o
[ 27%] Building CXX object src/binder/bind/CMakeFiles/lbug_binder_bind.dir/bind_use_database.cpp.o
[ 27%] Built target lbug_binder_bind_expression
[ 27%] Building CXX object src/binder/ddl/CMakeFiles/lbug_binder_ddl.dir/bound_alter_info.cpp.o
[ 27%] Building CXX object src/binder/bind/CMakeFiles/lbug_binder_bind.dir/bind_standalone_call_function.cpp.o
[ 27%] Building CXX object src/binder/ddl/CMakeFiles/lbug_binder_ddl.dir/property_definition.cpp.o
[ 27%] Built target lbug_binder_ddl
[ 27%] Building CXX object src/binder/expression/CMakeFiles/lbug_binder_expression.dir/aggregate_function_expression.cpp.o
[ 27%] Built target lbug_binder_bind
[ 27%] Building CXX object src/binder/query/CMakeFiles/lbug_binder_query.dir/bound_insert_clause.cpp.o
[ 27%] Building CXX object src/binder/expression/CMakeFiles/lbug_binder_expression.dir/case_expression.cpp.o
[ 27%] Building CXX object src/binder/expression/CMakeFiles/lbug_binder_expression.dir/expression.cpp.o
[ 27%] Building CXX object src/binder/query/CMakeFiles/lbug_binder_query.dir/bound_delete_clause.cpp.o
[ 28%] Building CXX object src/binder/query/CMakeFiles/lbug_binder_query.dir/bound_merge_clause.cpp.o
[ 29%] Building CXX object src/binder/expression/CMakeFiles/lbug_binder_expression.dir/expression_util.cpp.o
[ 29%] Building CXX object src/binder/query/CMakeFiles/lbug_binder_query.dir/bound_set_clause.cpp.o
[ 29%] Building CXX object src/binder/query/CMakeFiles/lbug_binder_query.dir/query_graph.cpp.o
[ 29%] Building CXX object src/binder/expression/CMakeFiles/lbug_binder_expression.dir/literal_expression.cpp.o
[ 29%] Building CXX object src/binder/expression/CMakeFiles/lbug_binder_expression.dir/node_expression.cpp.o
[ 29%] Building CXX object src/binder/query/CMakeFiles/lbug_binder_query.dir/query_graph_label_analyzer.cpp.o
[ 29%] Building CXX object src/binder/expression/CMakeFiles/lbug_binder_expression.dir/node_rel_expression.cpp.o
[ 29%] Building CXX object src/binder/expression/CMakeFiles/lbug_binder_expression.dir/parameter_expression.cpp.o
[ 29%] Built target lbug_binder_query
[ 29%] Building CXX object src/binder/expression/CMakeFiles/lbug_binder_expression.dir/property_expression.cpp.o
[ 29%] Building CXX object src/binder/rewriter/CMakeFiles/lbug_binder_rewriter.dir/match_clause_pattern_label_rewriter.cpp.o
[ 29%] Building CXX object src/binder/expression/CMakeFiles/lbug_binder_expression.dir/rel_expression.cpp.o
[ 29%] Building CXX object src/binder/rewriter/CMakeFiles/lbug_binder_rewriter.dir/normalized_query_part_match_rewriter.cpp.o
[ 29%] Building CXX object src/binder/expression/CMakeFiles/lbug_binder_expression.dir/scalar_function_expression.cpp.o
[ 29%] Building CXX object src/binder/rewriter/CMakeFiles/lbug_binder_rewriter.dir/with_clause_projection_rewriter.cpp.o
[ 29%] Building CXX object src/binder/expression/CMakeFiles/lbug_binder_expression.dir/variable_expression.cpp.o
[ 29%] Built target lbug_binder_expression
[ 29%] Building CXX object src/binder/visitor/CMakeFiles/lbug_binder_visitor.dir/confidential_statement_analyzer.cpp.o
[ 29%] Building CXX object src/binder/visitor/CMakeFiles/lbug_binder_visitor.dir/default_type_solver.cpp.o
[ 29%] Built target lbug_binder_rewriter
[ 29%] Building CXX object src/c_api/CMakeFiles/lbug_c_api.dir/connection.cpp.o
[ 29%] Building CXX object src/binder/visitor/CMakeFiles/lbug_binder_visitor.dir/property_collector.cpp.o
/Volumes/Temp/tmp/rladybugdb-lbug.uYEi9z/lbug-src/src/c_api/connection.cpp:110:10: error: no member named 'atomic_ref' in namespace 'std'
110 | std::atomic_ref<void*> atomic_conn(connection->_connection);
| ~~~~~^
/Volumes/Temp/tmp/rladybugdb-lbug.uYEi9z/lbug-src/src/c_api/connection.cpp:110:25: error: expected '(' for function-style cast or type construction
110 | std::atomic_ref<void*> atomic_conn(connection->_connection);
| ~~~~^
/Volumes/Temp/tmp/rladybugdb-lbug.uYEi9z/lbug-src/src/c_api/connection.cpp:110:26: error: expected expression
110 | std::atomic_ref<void*> atomic_conn(connection->_connection);
| ^
/Volumes/Temp/tmp/rladybugdb-lbug.uYEi9z/lbug-src/src/c_api/connection.cpp:110:28: error: use of undeclared identifier 'atomic_conn'; did you mean 'std::atomic_long'?
110 | std::atomic_ref<void*> atomic_conn(connection->_connection);
| ^
/Library/Developer/CommandLineTools/SDKs/MacOSX14.sdk/usr/include/c++/v1/__atomic/aliases.h:36:7: note: 'std::atomic_long' declared here
36 | using atomic_long = atomic<long>;
| ^
/Volumes/Temp/tmp/rladybugdb-lbug.uYEi9z/lbug-src/src/c_api/connection.cpp:111:17: error: use of undeclared identifier 'atomic_conn'
111 | void* ptr = atomic_conn.exchange(nullptr);
| ^
5 errors generated.
make[3]: *** [src/c_api/CMakeFiles/lbug_c_api.dir/connection.cpp.o] Error 1
make[2]: *** [src/c_api/CMakeFiles/lbug_c_api.dir/all] Error 2
make[2]: *** Waiting for unfinished jobs....
[ 29%] Built target lbug_binder_visitor
make[1]: *** [src/CMakeFiles/lbug.dir/rule] Error 2
make: *** [lbug] Error 2
ERROR: configuration failed for package ‘rladybugdb’
* removing ‘/Volumes/Builds/packages/sonoma-arm64/results/4.6/rladybugdb.Rcheck/rladybugdb’