ERROR: failed to lock directory ‘/data/localhost/ripley/R/packages/tests-clang/zucrypt.Rcheck’ for modifying
Try removing ‘/data/localhost/ripley/R/packages/tests-clang/zucrypt.Rcheck/00LOCK-zucrypt’
error: unable to rename temporary '/data/localhost/ripley/R/packages/tests-clang/zucrypt/src/vendor/tf-psa-crypto/lib/psa_crypto-1891d1cb.o.tmp' to output file '/data/localhost/ripley/R/packages/tests-clang/zucrypt/src/vendor/tf-psa-crypto/lib/psa_crypto.o': 'No such file or directory'
1 error generated.
make[1]: *** [/data/localhost/ripley/R/R-clang/etc/Makeconf:190: vendor/tf-psa-crypto/lib/psa_crypto.o] Error 1
/usr/local/clang23/bin/clang-23 -std=gnu23 -I"/data/localhost/ripley/R/R-clang/include" -DNDEBUG -I. -I../inst/include -Ivendor/tf-psa-crypto/inc -Ivendor/tf-psa-crypto/lib -DTF_PSA_CRYPTO_CONFIG_FILE='"zuc_crypto_config.h"'   -isystem /usr/local/clang23/include -I/usr/local/clang/include   -fvisibility=hidden -fpic  -O3 -Wall -pedantic -Wp,-D_FORTIFY_SOURCE=3  -c vendor/tf-psa-crypto/lib/psa_crypto_client.c -o vendor/tf-psa-crypto/lib/psa_crypto_client.o
make[1]: *** No rule to make target 'vendor/tf-psa-crypto/lib/psa_crypto_driver_wrappers_no_static.o', needed by 'zucrypt.so'.
make[1]: *** No rule to make target 'vendor/tf-psa-crypto/lib/psa_crypto_slot_management.o', needed by 'zucrypt.so'.
make[1]: *** No rule to make target 'vendor/tf-psa-crypto/lib/psa_util.o', needed by 'zucrypt.so'.
make[1]: *** No rule to make target 'vendor/tf-psa-crypto/lib/aes.o', needed by 'zucrypt.so'.
make[1]: *** No rule to make target 'vendor/tf-psa-crypto/lib/aesni.o', needed by 'zucrypt.so'.
make[1]: *** No rule to make target 'vendor/tf-psa-crypto/lib/aesce.o', needed by 'zucrypt.so'.
make[1]: *** No rule to make target 'vendor/tf-psa-crypto/lib/cipher.o', needed by 'zucrypt.so'.
make[1]: *** No rule to make target 'vendor/tf-psa-crypto/lib/cipher_wrap.o', needed by 'zucrypt.so'.
make[1]: *** No rule to make target 'vendor/tf-psa-crypto/lib/psa_crypto_cipher.o', needed by 'zucrypt.so'.
make[1]: *** No rule to make target 'vendor/tf-psa-crypto/lib/psa_crypto_hash.o', needed by 'zucrypt.so'.
make[1]: *** No rule to make target 'vendor/tf-psa-crypto/lib/psa_crypto_mac.o', needed by 'zucrypt.so'.
make[1]: *** No rule to make target 'vendor/tf-psa-crypto/lib/psa_crypto_rsa.o', needed by 'zucrypt.so'.
make[1]: *** No rule to make target 'vendor/tf-psa-crypto/lib/psa_util_internal.o', needed by 'zucrypt.so'.
make[1]: *** No rule to make target 'vendor/tf-psa-crypto/lib/sha1.o', needed by 'zucrypt.so'.
make[1]: *** No rule to make target 'vendor/tf-psa-crypto/lib/sha256.o', needed by 'zucrypt.so'.
make[1]: *** No rule to make target 'vendor/tf-psa-crypto/lib/sha512.o', needed by 'zucrypt.so'.
make[1]: *** No rule to make target 'vendor/tf-psa-crypto/lib/platform_util.o', needed by 'zucrypt.so'.
make[1]: *** No rule to make target 'vendor/tf-psa-crypto/lib/constant_time.o', needed by 'zucrypt.so'.
shell-init: error retrieving current directory: getcwd: cannot access parent directories: No such file or directory
clang-23: error: no such file or directory: 'vendor/tf-psa-crypto/lib/psa_crypto_client.c'
clang-23: error: no input files
make[1]: *** [/data/localhost/ripley/R/R-clang/etc/Makeconf:190: vendor/tf-psa-crypto/lib/psa_crypto_client.o] Error 1
make[1]: Target 'all' not remade because of errors.
make[1]: Leaving directory '/data/localhost/ripley/R/packages/tests-clang/zucrypt/src'
Error in setwd(owd) : cannot change working directory